{"text_format":"1","workbook":"xlsx","n_sheets":8,"sheets":["Raw Data","Read Me","Summary","FY Analysis","STOP Analysis","Program Mix","Checks","Sources & Notes"],"not_rendered":{"charts":1,"images":0,"macros":0,"external_links":0,"defined_names":1,"comments":0,"pivot_tables":0},"unopened":[],"bounds":{"document_bytes":16777216,"sheet_cells":100000,"rows_first":2000,"rows_last":500,"rows_between":2000,"halvings":0,"cell_chars":16384,"cell_head_chars":4096},"cells_cut":0,"cells_raw":0,"read":"whole","date_system":"1900"}

{"sheet":"Raw Data","index":0,"n_rows":259,"n_cols":14,"rows_kept":259,"cut":false,"hidden":false,"merged":[]}
["Award Number","Organization","City","State","Amount","Award FY","Award Date","Title","Project Period","NOFO Number","Center Scope","Action Type","Program Family","Data Note"]
["SP084776-01","INTERACTION, INC. dba YOUTH SERVICES, INC.","BRATTLEBORO","VT",250000.0,2025.0,"2025-09-30","Strategic Prevention Framework – Partnerships for Success for Communities and Tribes","2025/09/30-2030/09/29","SP-25-002",{"$f":"IF(LEFT(A2,2)=\"SP\",\"CSAP (SP)\",\"Other center (TI)\")","v":"CSAP (SP)"},{"$f":"IF(RIGHT(A2,3)=\"-01\",\"New Start\",\"Continuation / Other\")","v":"New Start"},"SPF-PFS","Suffix present"]
["SP084968-01","VILLAGE FOR FAMILIES AND CHILDREN, INC.","HARTFORD","CT",250000.0,2025.0,"2025-09-29","Strategic Prevention Framework – Partnerships for Success for Communities and Tribes","2025/09/30-2030/09/29","SP-25-002","CSAP (SP)","New Start","SPF-PFS","Suffix present"]
["SP084801-01","TOWN OF MIDDLETOWN","MIDDLETOWN","RI",250000.0,2025.0,"2025-09-29","Strategic Prevention Framework – Partnerships for Success for Communities and Tribes","2025/09/30-2030/09/29","SP-25-002","CSAP (SP)","New Start","SPF-PFS","Suffix present"]
["SP084876-01","MEDFORD, CITY OF","MEDFORD","MA",250000.0,2025.0,"2025-09-29","Strategic Prevention Framework – Partnerships for Success for Communities and Tribes","2025/09/30-2030/09/29","SP-25-002","CSAP (SP)","New Start","SPF-PFS","Suffix present"]
["SP084601-01","CHILD HEALTH/DEVELOPMENT INSTITUTE OF CT","FARMINGTON","CT",425000.0,2025.0,"2025-09-29","Strategic Prevention Framework – Partnerships for Success for Communities and Tribes","2025/09/30-2030/09/29","SP-25-002","CSAP (SP)","New Start","SPF-PFS","Suffix present"]
["SP084685-01","GANDARA MENTAL HEALTH CENTER","WEST SPRINGFIELD","MA",425000.0,2025.0,"2025-09-29","Strategic Prevention Framework – Partnerships for Success for Communities and Tribes","2025/09/30-2030/09/29","SP-25-002","CSAP (SP)","New Start","SPF-PFS","Suffix present"]
["SP084326-02S1","ADCARE EDUCATIONAL INSTITUTE OF MAINE, INC.","AUGUSTA","ME",227272.0,2025.0,"2025-09-29","FY 2024 Prevention Technology Transfer Centers Cooperative Agreements","2024/09/30-2029/09/29","SP-24-002","CSAP (SP)","Continuation / Other","PTTC","Suffix present"]
["SP084399-02","BRIDGES HEALTHCARE, INC.","MILFORD","CT",60000.0,2025.0,"2025-09-29","Sober Truth on Preventing Underage Drinking Act Grants","2024/09/30-2028/09/29","SP-24-001","CSAP (SP)","Continuation / Other","STOP Act","Suffix present"]
["SP084405-02","BRIDGES HEALTHCARE, INC.","MILFORD","CT",60000.0,2025.0,"2025-09-29","Sober Truth on Preventing Underage Drinking Act Grants","2024/09/30-2028/09/29","SP-24-001","CSAP (SP)","Continuation / Other","STOP Act","Suffix present"]
["SP084169-02","CENTRAL VERMONT MEDICAL CENTER, INC.","BERLIN","VT",374304.0,2025.0,"2025-09-29","Strategic Prevention Framework-Partnerships for Success for Communities, Local Governments, Universities, Colleges, and Tribes/Tribal Organizations","2024/09/30-2029/09/29","SP-23-004","CSAP (SP)","Continuation / Other","SPF-PFS","Suffix present"]
["SP083808-03","BOSTON PUBLIC HEALTH COMMISSION","BOSTON","MA",31113.0,2025.0,"2025-09-29","Strategic Prevention Framework-Partnerships for Success for Communities, Local Governments, Universities, Colleges, and Tribes/Tribal Organizations","2023/09/30-2028/09/29","SP-23-004","CSAP (SP)","Continuation / Other","SPF-PFS","Suffix present"]
["SP083624-03","COASTLINE EAP (EMPLOYEE ASSISTANCE PROGRAM)","WARWICK","RI",60000.0,2025.0,"2025-09-29","FY 2023 Sober Truth on Preventing Underage Drinking Act Grants","2023/09/30-2027/09/29","SP-23-002","CSAP (SP)","Continuation / Other","STOP Act","Suffix present"]
["SP083570-03","MEDWAY PUBLIC SCHOOLS","MEDWAY","MA",48000.0,2025.0,"2025-09-29","FY 2023 Sober Truth on Preventing Underage Drinking Act Grants","2023/09/30-2027/09/29","SP-23-002","CSAP (SP)","Continuation / Other","STOP Act","Suffix present"]
["SP083488-03","COMMUNITY AGAINST SUBSTANCE ABUSE","WINTHROP","MA",60000.0,2025.0,"2025-09-29","FY 2023 Sober Truth on Preventing Underage Drinking Act Grants","2023/09/30-2027/09/29","SP-23-002","CSAP (SP)","Continuation / Other","STOP Act","Suffix present"]
{"$rows_left_out":245}
{"sheet":"Read Me","index":1,"n_rows":34,"n_cols":4,"rows_kept":34,"cut":false,"hidden":false,"merged":[[20,1,20,7],[21,1,21,7],[22,1,22,7],[23,1,23,7],[25,0,25,7],[26,0,29,7],[0,0,1,7],[2,0,2,7],[4,0,4,7],[5,0,8,7],[10,0,10,7],[18,0,18,7],[19,1,19,7]]}
["Region 1 Grant Award Trend Analysis"]
[]
["FY2022-FY2025 | Auditable companion resource for the Prevention Continuity Playbook"]
[]
["Purpose and scope"]
["This workbook calculates the financial statements on page 5 of the Prevention Continuity Playbook using the 258 award-action records supplied in grant-awards-2026-08-04.csv. It separates all records from CSAP/SP-prefix records, distinguishes new starts from continuation/other actions, and keeps the complete source data available for independent analysis."]
[]
[]
[]
[]
["Methodology"]
["Measure","Definition"]
["Total award dollars","Sum of Amount across award-action records for the fiscal year."]
["CSAP scope","Award Number begins with SP. Two FY2024 and two FY2025 TI-prefix records are shown separately as other-center records."]
["New start","Award Number ends in -01. All other values, including supplements and 11 FY2025 records with no year suffix, are classified as Continuation / Other."]
{"$rows_left_out":20}
{"sheet":"Summary","index":2,"n_rows":26,"n_cols":7,"rows_kept":26,"cut":false,"hidden":false,"merged":[[0,0,1,9],[2,0,2,9],[4,0,4,2],[4,3,4,5],[4,6,4,9],[5,0,6,2],[5,3,6,5],[21,1,21,9],[24,0,24,9],[25,0,28,9],[5,6,6,9],[15,0,15,9],[16,1,16,9],[17,1,17,9],[18,1,18,9],[19,1,19,9],[20,1,20,9]]}
["Region 1 Grant Award Trends"]
[]
["The defensible story: annual dollars peaked in FY2023, new starts contracted in FY2025, and continuation funding masked the STOP opportunity decline."]
[]
["FY2022 - All award dollars",null,null,"FY2025 - All award dollars",null,null,"FY2022 to FY2025 change"]
[{"$f":"'FY Analysis'!C6","v":18851609},null,null,{"$f":"'FY Analysis'!C9","v":16800358},null,null,{"$f":"'FY Analysis'!E15","v":-0.1088103939}]
[]
[]
["Fiscal Year","All Award Dollars","YoY","CSAP Award Dollars","YoY","All Actions"]
[2022.0,{"$f":"'FY Analysis'!C6","v":18851609},{"$f":"'FY Analysis'!D6","v":""},{"$f":"'FY Analysis'!F6","v":18851609},{"$f":"'FY Analysis'!G6","v":""},{"$f":"'FY Analysis'!B6","v":62}]
[2023.0,{"$f":"'FY Analysis'!C7","v":19471250},{"$f":"'FY Analysis'!D7","v":0.03286939592},{"$f":"'FY Analysis'!F7","v":19471250},{"$f":"'FY Analysis'!G7","v":0.03286939592},{"$f":"'FY Analysis'!B7","v":70}]
[2024.0,{"$f":"'FY Analysis'!C8","v":17431993},{"$f":"'FY Analysis'!D8","v":-0.1047316942},{"$f":"'FY Analysis'!F8","v":16079840},{"$f":"'FY Analysis'!G8","v":-0.1741752584},{"$f":"'FY Analysis'!B8","v":64}]
[2025.0,{"$f":"'FY Analysis'!C9","v":16800358},{"$f":"'FY Analysis'!D9","v":-0.03623423897},{"$f":"'FY Analysis'!F9","v":15427780},{"$f":"'FY Analysis'!G9","v":-0.04055139852},{"$f":"'FY Analysis'!B9","v":62}]
[]
[]
{"$rows_left_out":12}
{"sheet":"FY Analysis","index":3,"n_rows":19,"n_cols":13,"rows_kept":19,"cut":false,"hidden":false,"merged":[[0,0,1,12],[2,0,2,12],[11,0,11,5]]}
["Fiscal-Year Analysis"]
[]
["Every output below is formula-driven from the Raw Data tab."]
[]
["Fiscal Year","All Actions","All Award Dollars","YoY - All Dollars","CSAP Actions","CSAP Award Dollars","YoY - CSAP Dollars","New Starts - All","New-Start $ - All","New Starts - CSAP","New-Start $ - CSAP","Continuation/Other $ - All","Continuation Share"]
[2022.0,{"$f":"COUNTIFS('Raw Data'!$F$2:$F$259,A6)","v":62},{"$f":"SUMIFS('Raw Data'!$E$2:$E$259,'Raw Data'!$F$2:$F$259,A6)","v":18851609},null,{"$f":"COUNTIFS('Raw Data'!$F$2:$F$259,A6,'Raw Data'!$K$2:$K$259,\"CSAP (SP)\")","v":62},{"$f":"SUMIFS('Raw Data'!$E$2:$E$259,'Raw Data'!$F$2:$F$259,A6,'Raw Data'!$K$2:$K$259,\"CSAP (SP)\")","v":18851609},null,{"$f":"COUNTIFS('Raw Data'!$F$2:$F$259,A6,'Raw Data'!$L$2:$L$259,\"New Start\")","v":14},{"$f":"SUMIFS('Raw Data'!$E$2:$E$259,'Raw Data'!$F$2:$F$259,A6,'Raw Data'!$L$2:$L$259,\"New Start\")","v":5304062},{"$f":"COUNTIFS('Raw Data'!$F$2:$F$259,A6,'Raw Data'!$K$2:$K$259,\"CSAP (SP)\",'Raw Data'!$L$2:$L$259,\"New Start\")","v":14},{"$f":"SUMIFS('Raw Data'!$E$2:$E$259,'Raw Data'!$F$2:$F$259,A6,'Raw Data'!$K$2:$K$259,\"CSAP (SP)\",'Raw Data'!$L$2:$L$259,\"New Start\")","v":5304062},{"$f":"SUMIFS('Raw Data'!$E$2:$E$259,'Raw Data'!$F$2:$F$259,A6,'Raw Data'!$L$2:$L$259,\"Continuation / Other\")","v":13547547},{"$f":"IFERROR(L6/C6,\"\")","v":0.7186414168}]
[2023.0,{"$f":"COUNTIFS('Raw Data'!$F$2:$F$259,A7)","v":70},{"$f":"SUMIFS('Raw Data'!$E$2:$E$259,'Raw Data'!$F$2:$F$259,A7)","v":19471250},{"$f":"IFERROR(C7/C6-1,\"\")","v":0.03286939592},{"$f":"COUNTIFS('Raw Data'!$F$2:$F$259,A7,'Raw Data'!$K$2:$K$259,\"CSAP (SP)\")","v":70},{"$f":"SUMIFS('Raw Data'!$E$2:$E$259,'Raw Data'!$F$2:$F$259,A7,'Raw Data'!$K$2:$K$259,\"CSAP (SP)\")","v":19471250},{"$f":"IFERROR(F7/F6-1,\"\")","v":0.03286939592},{"$f":"COUNTIFS('Raw Data'!$F$2:$F$259,A7,'Raw Data'!$L$2:$L$259,\"New Start\")","v":15},{"$f":"SUMIFS('Raw Data'!$E$2:$E$259,'Raw Data'!$F$2:$F$259,A7,'Raw Data'!$L$2:$L$259,\"New Start\")","v":3812678},{"$f":"COUNTIFS('Raw Data'!$F$2:$F$259,A7,'Raw Data'!$K$2:$K$259,\"CSAP (SP)\",'Raw Data'!$L$2:$L$259,\"New Start\")","v":15},{"$f":"SUMIFS('Raw Data'!$E$2:$E$259,'Raw Data'!$F$2:$F$259,A7,'Raw Data'!$K$2:$K$259,\"CSAP (SP)\",'Raw Data'!$L$2:$L$259,\"New Start\")","v":3812678},{"$f":"SUMIFS('Raw Data'!$E$2:$E$259,'Raw Data'!$F$2:$F$259,A7,'Raw Data'!$L$2:$L$259,\"Continuation / Other\")","v":15658572},0.8041893561]
[2024.0,{"$f":"COUNTIFS('Raw Data'!$F$2:$F$259,A8)","v":64},{"$f":"SUMIFS('Raw Data'!$E$2:$E$259,'Raw Data'!$F$2:$F$259,A8)","v":17431993},-0.1047316942,{"$f":"COUNTIFS('Raw Data'!$F$2:$F$259,A8,'Raw Data'!$K$2:$K$259,\"CSAP (SP)\")","v":62},{"$f":"SUMIFS('Raw Data'!$E$2:$E$259,'Raw Data'!$F$2:$F$259,A8,'Raw Data'!$K$2:$K$259,\"CSAP (SP)\")","v":16079840},-0.1741752584,{"$f":"COUNTIFS('Raw Data'!$F$2:$F$259,A8,'Raw Data'!$L$2:$L$259,\"New Start\")","v":20},{"$f":"SUMIFS('Raw Data'!$E$2:$E$259,'Raw Data'!$F$2:$F$259,A8,'Raw Data'!$L$2:$L$259,\"New Start\")","v":4056456},{"$f":"COUNTIFS('Raw Data'!$F$2:$F$259,A8,'Raw Data'!$K$2:$K$259,\"CSAP (SP)\",'Raw Data'!$L$2:$L$259,\"New Start\")","v":18},{"$f":"SUMIFS('Raw Data'!$E$2:$E$259,'Raw Data'!$F$2:$F$259,A8,'Raw Data'!$K$2:$K$259,\"CSAP (SP)\",'Raw Data'!$L$2:$L$259,\"New Start\")","v":2704303},{"$f":"SUMIFS('Raw Data'!$E$2:$E$259,'Raw Data'!$F$2:$F$259,A8,'Raw Data'!$L$2:$L$259,\"Continuation / Other\")","v":13375537},0.7672982085]
[2025.0,{"$f":"COUNTIFS('Raw Data'!$F$2:$F$259,A9)","v":62},{"$f":"SUMIFS('Raw Data'!$E$2:$E$259,'Raw Data'!$F$2:$F$259,A9)","v":16800358},-0.03623423897,{"$f":"COUNTIFS('Raw Data'!$F$2:$F$259,A9,'Raw Data'!$K$2:$K$259,\"CSAP (SP)\")","v":60},{"$f":"SUMIFS('Raw Data'!$E$2:$E$259,'Raw Data'!$F$2:$F$259,A9,'Raw Data'!$K$2:$K$259,\"CSAP (SP)\")","v":15427780},-0.04055139852,{"$f":"COUNTIFS('Raw Data'!$F$2:$F$259,A9,'Raw Data'!$L$2:$L$259,\"New Start\")","v":12},{"$f":"SUMIFS('Raw Data'!$E$2:$E$259,'Raw Data'!$F$2:$F$259,A9,'Raw Data'!$L$2:$L$259,\"New Start\")","v":4150000},{"$f":"COUNTIFS('Raw Data'!$F$2:$F$259,A9,'Raw Data'!$K$2:$K$259,\"CSAP (SP)\",'Raw Data'!$L$2:$L$259,\"New Start\")","v":12},{"$f":"SUMIFS('Raw Data'!$E$2:$E$259,'Raw Data'!$F$2:$F$259,A9,'Raw Data'!$K$2:$K$259,\"CSAP (SP)\",'Raw Data'!$L$2:$L$259,\"New Start\")","v":4150000},{"$f":"SUMIFS('Raw Data'!$E$2:$E$259,'Raw Data'!$F$2:$F$259,A9,'Raw Data'!$L$2:$L$259,\"Continuation / Other\")","v":12650358},0.7529814543]
[]
[]
["Selected changes - explicit math"]
["Measure","Earlier Value","Later Value","Change","% Change","Formula"]
["All award dollars, FY2024 to FY2025",{"$f":"C8","v":17431993},{"$f":"C9","v":16800358},{"$f":"C14-B14","v":-631635},{"$f":"IFERROR(D14/B14,\"\")","v":-0.03623423897},"(FY25 - FY24) / FY24"]
["All award dollars, FY2022 to FY2025",{"$f":"C6","v":18851609},{"$f":"C9","v":16800358},-2051251,-0.1088103939,"(FY25 - FY22) / FY22"]
{"$rows_left_out":5}
{"sheet":"STOP Analysis","index":4,"n_rows":20,"n_cols":8,"rows_kept":20,"cut":false,"hidden":false,"merged":[[0,0,1,7],[2,0,2,7],[4,0,4,7],[12,0,12,7],[18,0,18,7],[19,0,23,7]]}
["STOP Act Analysis"]
[]
["Regional award-action trends and national opportunity estimates are deliberately separated."]
[]
["Region 1 award-action records"]
["Fiscal Year","Total STOP Actions","Total STOP Dollars","New STOP Starts","New-Start Dollars","YoY - Total $","YoY - New Starts","YoY - New-Start $"]
[2022.0,{"$f":"COUNTIFS('Raw Data'!$F$2:$F$259,A7,'Raw Data'!$M$2:$M$259,\"STOP Act\")","v":21},{"$f":"SUMIFS('Raw Data'!$E$2:$E$259,'Raw Data'!$F$2:$F$259,A7,'Raw Data'!$M$2:$M$259,\"STOP Act\")","v":1043759},{"$f":"COUNTIFS('Raw Data'!$F$2:$F$259,A7,'Raw Data'!$M$2:$M$259,\"STOP Act\",'Raw Data'!$L$2:$L$259,\"New Start\")","v":6},{"$f":"SUMIFS('Raw Data'!$E$2:$E$259,'Raw Data'!$F$2:$F$259,A7,'Raw Data'!$M$2:$M$259,\"STOP Act\",'Raw Data'!$L$2:$L$259,\"New Start\")","v":299723}]
[2023.0,{"$f":"COUNTIFS('Raw Data'!$F$2:$F$259,A8,'Raw Data'!$M$2:$M$259,\"STOP Act\")","v":27},{"$f":"SUMIFS('Raw Data'!$E$2:$E$259,'Raw Data'!$F$2:$F$259,A8,'Raw Data'!$M$2:$M$259,\"STOP Act\")","v":1438041},{"$f":"COUNTIFS('Raw Data'!$F$2:$F$259,A8,'Raw Data'!$M$2:$M$259,\"STOP Act\",'Raw Data'!$L$2:$L$259,\"New Start\")","v":10},{"$f":"SUMIFS('Raw Data'!$E$2:$E$259,'Raw Data'!$F$2:$F$259,A8,'Raw Data'!$M$2:$M$259,\"STOP Act\",'Raw Data'!$L$2:$L$259,\"New Start\")","v":588389},{"$f":"IFERROR(C8/C7-1,\"\")","v":0.3777519523},0.6666666667,0.9631092709]
[2024.0,{"$f":"COUNTIFS('Raw Data'!$F$2:$F$259,A9,'Raw Data'!$M$2:$M$259,\"STOP Act\")","v":31},{"$f":"SUMIFS('Raw Data'!$E$2:$E$259,'Raw Data'!$F$2:$F$259,A9,'Raw Data'!$M$2:$M$259,\"STOP Act\")","v":1779620},{"$f":"COUNTIFS('Raw Data'!$F$2:$F$259,A9,'Raw Data'!$M$2:$M$259,\"STOP Act\",'Raw Data'!$L$2:$L$259,\"New Start\")","v":14},{"$f":"SUMIFS('Raw Data'!$E$2:$E$259,'Raw Data'!$F$2:$F$259,A9,'Raw Data'!$M$2:$M$259,\"STOP Act\",'Raw Data'!$L$2:$L$259,\"New Start\")","v":840000},{"$f":"IFERROR(C9/C8-1,\"\")","v":0.2375307797},0.4,0.4276269611]
[2025.0,{"$f":"COUNTIFS('Raw Data'!$F$2:$F$259,A10,'Raw Data'!$M$2:$M$259,\"STOP Act\")","v":32},{"$f":"SUMIFS('Raw Data'!$E$2:$E$259,'Raw Data'!$F$2:$F$259,A10,'Raw Data'!$M$2:$M$259,\"STOP Act\")","v":1844604},{"$f":"COUNTIFS('Raw Data'!$F$2:$F$259,A10,'Raw Data'!$M$2:$M$259,\"STOP Act\",'Raw Data'!$L$2:$L$259,\"New Start\")","v":5},{"$f":"SUMIFS('Raw Data'!$E$2:$E$259,'Raw Data'!$F$2:$F$259,A10,'Raw Data'!$M$2:$M$259,\"STOP Act\",'Raw Data'!$L$2:$L$259,\"New Start\")","v":300000},{"$f":"IFERROR(C10/C9-1,\"\")","v":0.03651566065},-0.6428571429,-0.6428571429]
[]
[]
["National STOP funding opportunity estimates"]
["Fiscal Year","Estimated Program Funding","Expected Awards","Funding Change","Funding % Change","Award Change","Award % Change","Interpretation"]
[2024.0,4566000.0,76.0,null,null,null,null,"FY2024 baseline (SP-24-001)"]
{"$rows_left_out":6}
{"sheet":"Program Mix","index":5,"n_rows":15,"n_cols":6,"rows_kept":15,"cut":false,"hidden":false,"merged":[[0,0,1,5],[2,0,2,5]]}
["Program Mix by Fiscal Year"]
[]
["Award dollars by standardized program family; totals reconcile to the complete raw dataset."]
[]
["Program Family","FY2022","FY2023","FY2024","FY2025","Four-Year Total"]
["SPF-PFS",{"$f":"SUMIFS('Raw Data'!$E$2:$E$259,'Raw Data'!$M$2:$M$259,$A6,'Raw Data'!$F$2:$F$259,2022)","v":11954488},{"$f":"SUMIFS('Raw Data'!$E$2:$E$259,'Raw Data'!$M$2:$M$259,$A6,'Raw Data'!$F$2:$F$259,2023)","v":12075644},{"$f":"SUMIFS('Raw Data'!$E$2:$E$259,'Raw Data'!$M$2:$M$259,$A6,'Raw Data'!$F$2:$F$259,2024)","v":8826879},{"$f":"SUMIFS('Raw Data'!$E$2:$E$259,'Raw Data'!$M$2:$M$259,$A6,'Raw Data'!$F$2:$F$259,2025)","v":8546583},{"$f":"SUM(B6:E6)","v":41403594}]
["STOP Act",{"$f":"SUMIFS('Raw Data'!$E$2:$E$259,'Raw Data'!$M$2:$M$259,$A7,'Raw Data'!$F$2:$F$259,2022)","v":1043759},{"$f":"SUMIFS('Raw Data'!$E$2:$E$259,'Raw Data'!$M$2:$M$259,$A7,'Raw Data'!$F$2:$F$259,2023)","v":1438041},{"$f":"SUMIFS('Raw Data'!$E$2:$E$259,'Raw Data'!$M$2:$M$259,$A7,'Raw Data'!$F$2:$F$259,2024)","v":1779620},{"$f":"SUMIFS('Raw Data'!$E$2:$E$259,'Raw Data'!$M$2:$M$259,$A7,'Raw Data'!$F$2:$F$259,2025)","v":1844604},6106024]
["Overdose Prevention",{"$f":"SUMIFS('Raw Data'!$E$2:$E$259,'Raw Data'!$M$2:$M$259,$A8,'Raw Data'!$F$2:$F$259,2022)","v":1700000},{"$f":"SUMIFS('Raw Data'!$E$2:$E$259,'Raw Data'!$M$2:$M$259,$A8,'Raw Data'!$F$2:$F$259,2023)","v":2550000},{"$f":"SUMIFS('Raw Data'!$E$2:$E$259,'Raw Data'!$M$2:$M$259,$A8,'Raw Data'!$F$2:$F$259,2024)","v":2550000},{"$f":"SUMIFS('Raw Data'!$E$2:$E$259,'Raw Data'!$M$2:$M$259,$A8,'Raw Data'!$F$2:$F$259,2025)","v":2020000},8820000]
["SPF Prescription Drugs",{"$f":"SUMIFS('Raw Data'!$E$2:$E$259,'Raw Data'!$M$2:$M$259,$A9,'Raw Data'!$F$2:$F$259,2022)","v":768000},{"$f":"SUMIFS('Raw Data'!$E$2:$E$259,'Raw Data'!$M$2:$M$259,$A9,'Raw Data'!$F$2:$F$259,2023)","v":1152000},{"$f":"SUMIFS('Raw Data'!$E$2:$E$259,'Raw Data'!$M$2:$M$259,$A9,'Raw Data'!$F$2:$F$259,2024)","v":860836},{"$f":"SUMIFS('Raw Data'!$E$2:$E$259,'Raw Data'!$M$2:$M$259,$A9,'Raw Data'!$F$2:$F$259,2025)","v":1152000},3932836]
["HIV Prevention",{"$f":"SUMIFS('Raw Data'!$E$2:$E$259,'Raw Data'!$M$2:$M$259,$A10,'Raw Data'!$F$2:$F$259,2022)","v":1997512},{"$f":"SUMIFS('Raw Data'!$E$2:$E$259,'Raw Data'!$M$2:$M$259,$A10,'Raw Data'!$F$2:$F$259,2023)","v":1494909},{"$f":"SUMIFS('Raw Data'!$E$2:$E$259,'Raw Data'!$M$2:$M$259,$A10,'Raw Data'!$F$2:$F$259,2024)","v":1323124},{"$f":"SUMIFS('Raw Data'!$E$2:$E$259,'Raw Data'!$M$2:$M$259,$A10,'Raw Data'!$F$2:$F$259,2025)","v":897944},5713489]
["First Responders-CARA",{"$f":"SUMIFS('Raw Data'!$E$2:$E$259,'Raw Data'!$M$2:$M$259,$A11,'Raw Data'!$F$2:$F$259,2022)","v":0},{"$f":"SUMIFS('Raw Data'!$E$2:$E$259,'Raw Data'!$M$2:$M$259,$A11,'Raw Data'!$F$2:$F$259,2023)","v":0},{"$f":"SUMIFS('Raw Data'!$E$2:$E$259,'Raw Data'!$M$2:$M$259,$A11,'Raw Data'!$F$2:$F$259,2024)","v":1352153},{"$f":"SUMIFS('Raw Data'!$E$2:$E$259,'Raw Data'!$M$2:$M$259,$A11,'Raw Data'!$F$2:$F$259,2025)","v":1372578},2724731]
["PTTC",{"$f":"SUMIFS('Raw Data'!$E$2:$E$259,'Raw Data'!$M$2:$M$259,$A12,'Raw Data'!$F$2:$F$259,2022)","v":600000},{"$f":"SUMIFS('Raw Data'!$E$2:$E$259,'Raw Data'!$M$2:$M$259,$A12,'Raw Data'!$F$2:$F$259,2023)","v":0},{"$f":"SUMIFS('Raw Data'!$E$2:$E$259,'Raw Data'!$M$2:$M$259,$A12,'Raw Data'!$F$2:$F$259,2024)","v":739381},{"$f":"SUMIFS('Raw Data'!$E$2:$E$259,'Raw Data'!$M$2:$M$259,$A12,'Raw Data'!$F$2:$F$259,2025)","v":966649},2306030]
["Harm Reduction",{"$f":"SUMIFS('Raw Data'!$E$2:$E$259,'Raw Data'!$M$2:$M$259,$A13,'Raw Data'!$F$2:$F$259,2022)","v":787850},{"$f":"SUMIFS('Raw Data'!$E$2:$E$259,'Raw Data'!$M$2:$M$259,$A13,'Raw Data'!$F$2:$F$259,2023)","v":760656},{"$f":"SUMIFS('Raw Data'!$E$2:$E$259,'Raw Data'!$M$2:$M$259,$A13,'Raw Data'!$F$2:$F$259,2024)","v":0},{"$f":"SUMIFS('Raw Data'!$E$2:$E$259,'Raw Data'!$M$2:$M$259,$A13,'Raw Data'!$F$2:$F$259,2025)","v":0},1548506]
["Other",{"$f":"SUMIFS('Raw Data'!$E$2:$E$259,'Raw Data'!$M$2:$M$259,$A14,'Raw Data'!$F$2:$F$259,2022)","v":0},{"$f":"SUMIFS('Raw Data'!$E$2:$E$259,'Raw Data'!$M$2:$M$259,$A14,'Raw Data'!$F$2:$F$259,2023)","v":0},{"$f":"SUMIFS('Raw Data'!$E$2:$E$259,'Raw Data'!$M$2:$M$259,$A14,'Raw Data'!$F$2:$F$259,2024)","v":0},{"$f":"SUMIFS('Raw Data'!$E$2:$E$259,'Raw Data'!$M$2:$M$259,$A14,'Raw Data'!$F$2:$F$259,2025)","v":0},0]
["TOTAL",{"$f":"SUM(B6:B14)","v":18851609},19471250,17431993,16800358,72555210]
{"$rows_left_out":1}
{"sheet":"Checks","index":6,"n_rows":14,"n_cols":6,"rows_kept":14,"cut":false,"hidden":false,"merged":[[0,0,1,5],[2,0,2,5]]}
["Workbook Checks"]
[]
["PASS means the source rows, annual rollups, and analysis scopes reconcile."]
[]
["Check","Actual","Expected","Difference","Status","Where to fix / Notes"]
["Raw data row count",{"$f":"COUNTA('Raw Data'!$A$2:$A$259)","v":258},258.0,{"$f":"B6-C6","v":0},{"$f":"IF(ABS(D6)<0.01,\"OK\",\"REVIEW\")","v":"OK"},"Raw Data"]
["FY action counts sum to raw rows",{"$f":"SUM('FY Analysis'!$B$6:$B$9)","v":258},{"$f":"B6","v":258},0,"OK","FY Analysis B6:B9"]
["Annual award dollars tie to raw-data total",{"$f":"SUM('FY Analysis'!$C$6:$C$9)","v":72555210},{"$f":"SUM('Raw Data'!$E$2:$E$259)","v":72555210},0,"OK","FY Analysis C6:C9"]
["CSAP + other-center actions tie to raw rows",{"$f":"COUNTIF('Raw Data'!$K$2:$K$259,\"CSAP (SP)\")+COUNTIF('Raw Data'!$K$2:$K$259,\"Other center (TI)\")","v":258},{"$f":"B6","v":258},0,"OK","Raw Data Center Scope"]
["New + continuation/other actions tie to raw rows",{"$f":"COUNTIF('Raw Data'!$L$2:$L$259,\"New Start\")+COUNTIF('Raw Data'!$L$2:$L$259,\"Continuation / Other\")","v":258},{"$f":"B6","v":258},0,"OK","Raw Data Action Type"]
[]
["MODEL STATUS",{"$f":"IF(COUNTIF(E6:E10,\"REVIEW\")=0,\"PASS\",\"FAIL\")","v":"PASS"}]
["Required checks",5.0]
["Failed checks",{"$f":"COUNTIF(E6:E10,\"REVIEW\")","v":0}]

{"sheet":"Sources & Notes","index":7,"n_rows":15,"n_cols":6,"rows_kept":15,"cut":false,"hidden":false,"merged":[[0,0,1,5],[2,0,2,5],[13,0,13,5],[14,0,19,5]]}
["Sources and Audit Notes"]
[]
["Source definitions, access points, and limitations."]
[]
["Item","Period / As-of","Source Type","Source / File","Reference","Notes"]
["Region 1 award actions","FY2022-FY2025","Provided raw data","grant-awards-2026-08-04.csv","258 records","States represented: CT, ME, MA, NH, RI, VT."]
["Playbook statements","Current attached version","Provided PDF","Prevention-Continuity-Playbook(3).pdf","Page 5","Claims audited in Claim Check."]
["SAMHSA grant awards","Accessed 2026-08-04","Federal website","https://www.samhsa.gov/grants/grants-dashboard","Grants Dashboard","Underlying award-action context."]
["FY2024 STOP opportunity","FY2024","Federal NOFO","https://www.samhsa.gov/sites/default/files/grants/doc/fy-2024-stop-act-sp-24-001.docx","SP-24-001","$4,566,000 estimated funding; 76 expected awards."]
["FY2025 STOP opportunity","FY2025","Federal opportunity","https://simpler.grants.gov/opportunity/dc8fefd8-0410-4e24-956c-6ab57ac71fe1","SP-25-001","$750,000 estimated funding; 13 expected awards."]
["Prepared by","2026-08-04","Analysis","Nicole M. Augustine / RIZE Consultants","Version 1.0","Formula-driven companion resource."]
[]
[]
["Limitations"]
["This is a descriptive analysis of the supplied award-action extract. It does not measure congressional appropriations, obligations outside the extract, application volume, success rates, or the full national grant portfolio. Award numbers are used as the operational proxy for new starts; records ending in -01 are classified as new. Eleven FY2025 award numbers lack a year suffix in the source and are classified as continuation/other because none represents a newly appearing base award in the supplied time series. National STOP values are estimated opportunity amounts and expected award counts from the NOFOs, not actual Region 1 award totals."]